Reaction Details
TargetDipeptidyl peptidase 4
LigandBDBM11464
Substrate/Competitorn/a
Meas. Tech.ChEBML_53362
IC50 420±n/a nM
Citation Parmee, ERHe, JMastracchio, AEdmondson, SDColwell, LEiermann, GFeeney, WPHabulihaz, BHe, HKilburn, RLeiting, BLyons, KMarsilio, FPatel, RAPetrov, ADi Salvo, JWu, JKThornberry, NAWeber, AE 4-Amino cyclohexylglycine analogues as potent dipeptidyl peptidase IV inhibitors. Bioorg Med Chem Lett14:43-6 (2003) Dipeptidyl peptidase 4
Name:Dipeptidyl peptidase 4
Type:Enzyme
Mol. Mass.:88271.01
Organism:Homo sapiens (Human)
Description:P27487
Residue:766
BDBM11464
NameBDBM11464
Synonyms:(2S,3S)-2-amino-3-methyl-1-(1,3-thiazolidin-3-yl)pentan-1-one CHEMBL98408 thiazolidide 2
TypeSmall organic molecule
Emp. Form.C9H18N2OS
Mol. Mass.202.317
SMILESCC[C@H](C)[C@H](N)C(=O)N1CCSC1