Reaction Details
TargetMatrix metalloproteinase-14
LigandBDBM50137277
Substrate/Competitorn/a
Meas. Tech.ChEBML_106791
IC50 835±n/a nM
Citation Ma, DWu, WYang, GLi, JLi, JYe, Q Tetrahydroisoquinoline based sulfonamide hydroxamates as potent matrix metalloproteinase inhibitors. Bioorg Med Chem Lett14:47-50 (2003) Matrix metalloproteinase-14
Name:Matrix metalloproteinase-14
Type:Protein
Mol. Mass.:65900.19
Organism:Homo sapiens (Human)
Description:P50281
Residue:582
BDBM50137277
NameBDBM50137277
Synonyms:2-(4-Amino-benzenesulfonyl)-6-hydroxy-1,2,3,4-tetrahydro-isoquinoline-1-carboxylic acid hydroxyamide | CHEMBL148406
TypeSmall organic molecule
Emp. Form.C16H17N3O5S
Mol. Mass.363.388
SMILESNc1ccc(cc1)S(=O)(=O)N1CCc2cc(O)ccc2C1C(=O)NO