Reaction Details
TargetMatrix metalloproteinase-9
LigandBDBM50062351
Substrate/Competitorn/a
Meas. Tech.ChEBML_105527
IC50 15±n/a nM
Citation Ma, DWu, WYang, GLi, JLi, JYe, Q Tetrahydroisoquinoline based sulfonamide hydroxamates as potent matrix metalloproteinase inhibitors. Bioorg Med Chem Lett14:47-50 (2003) Matrix metalloproteinase-9
Name:Matrix metalloproteinase-9
Type:Enzyme
Mol. Mass.:78452.28
Organism:Homo sapiens (Human)
Description:P14780
Residue:707
BDBM50062351
NameBDBM50062351
Synonyms:(R)-N*4*-Hydroxy-N*1*-[(S)-2-(1H-indol-3-yl)-1-methylcarbamoyl-ethyl]-2-isobutyl-succinamide (R)-N1-((S)-3-(1H-indol-3-yl)-1-(methylamino)-1-oxopropan-2-yl)-N4-hydroxy-2-isobutylsuccinamide CHEMBL19611 US9487462, ilomastat
TypeSmall organic molecule
Emp. Form.C20H28N4O4
Mol. Mass.388.4607
SMILESCNC(=O)[C@H](Cc1c[nH]c2ccccc12)NC(=O)[C@H](CC(C)C)CC(=O)NO