Reaction Details
TargetMatrix metalloproteinase-9
LigandBDBM50137287
Substrate/Competitorn/a
Meas. Tech.ChEBML_105527
IC50 35±n/a nM
Citation Ma, DWu, WYang, GLi, JLi, JYe, Q Tetrahydroisoquinoline based sulfonamide hydroxamates as potent matrix metalloproteinase inhibitors. Bioorg Med Chem Lett14:47-50 (2003) Matrix metalloproteinase-9
Name:Matrix metalloproteinase-9
Type:Enzyme
Mol. Mass.:78452.28
Organism:Homo sapiens (Human)
Description:P14780
Residue:707
BDBM50137287
NameBDBM50137287
Synonyms:2-Benzenesulfonyl-6-benzyloxy-1,2,3,4-tetrahydro-isoquinoline-1-carboxylic acid hydroxyamide CHEMBL147881
TypeSmall organic molecule
Emp. Form.C23H22N2O5S
Mol. Mass.438.496
SMILESONC(=O)C1N(CCc2cc(OCc3ccccc3)ccc12)S(=O)(=O)c1ccccc1