Reaction Details
TargetMacrophage metalloelastase
LigandBDBM50137278
Substrate/Competitorn/a
Meas. Tech.ChEBML_106462
IC50 170±n/a nM
Citation Ma, DWu, WYang, GLi, JLi, JYe, Q Tetrahydroisoquinoline based sulfonamide hydroxamates as potent matrix metalloproteinase inhibitors. Bioorg Med Chem Lett14:47-50 (2003) Macrophage metalloelastase
Name:Macrophage metalloelastase
Type:Enzyme
Mol. Mass.:54012.99
Organism:Homo sapiens (Human)
Description:P39900
Residue:470
BDBM50137278
NameBDBM50137278
Synonyms:2-(2,5-Dichloro-benzenesulfonyl)-6-hydroxy-1,2,3,4-tetrahydro-isoquinoline-1-carboxylic acid hydroxyamide CHEMBL424130
TypeSmall organic molecule
Emp. Form.C16H14Cl2N2O5S
Mol. Mass.417.264
SMILESONC(=O)C1N(CCc2cc(O)ccc12)S(=O)(=O)c1cc(Cl)ccc1Cl