Reaction Details
Target72 kDa type IV collagenase
LigandBDBM50137282
Substrate/Competitorn/a
Meas. Tech.ChEBML_104556
IC50 18±n/a nM
Citation Ma, DWu, WYang, GLi, JLi, JYe, Q Tetrahydroisoquinoline based sulfonamide hydroxamates as potent matrix metalloproteinase inhibitors. Bioorg Med Chem Lett14:47-50 (2003) 72 kDa type IV collagenase
Name:72 kDa type IV collagenase
Type:Enzyme
Mol. Mass.:73870.36
Organism:Homo sapiens (Human)
Description: P08253
Residue:660
BDBM50137282
NameBDBM50137282
Synonyms:6-Hydroxy-2-(toluene-4-sulfonyl)-1,2,3,4-tetrahydro-isoquinoline-1-carboxylic acid hydroxyamide N,6-dihydroxy-2-tosyl-1,2,3,4-tetrahydroisoquinoline-1-carboxamide
TypeSmall organic molecule
Emp. Form.C17H18N2O5S
Mol. Mass.362.4
SMILESCc1ccc(cc1)S(=O)(=O)N1CCc2cc(O)ccc2C1C(=O)NO