Reaction Details
TargetMatrix metalloproteinase-16
LigandBDBM50137278
Substrate/Competitorn/a
Meas. Tech.ChEBML_106799
IC50 1839±n/a nM
Citation Ma, DWu, WYang, GLi, JLi, JYe, Q Tetrahydroisoquinoline based sulfonamide hydroxamates as potent matrix metalloproteinase inhibitors. Bioorg Med Chem Lett14:47-50 (2003) Matrix metalloproteinase-16
Name:Matrix metalloproteinase-16
Type:PROTEIN
Mol. Mass.:69536.76
Organism:Homo sapiens (Human)
Description:ChEMBL_799129
Residue:607
BDBM50137278
NameBDBM50137278
Synonyms:2-(2,5-Dichloro-benzenesulfonyl)-6-hydroxy-1,2,3,4-tetrahydro-isoquinoline-1-carboxylic acid hydroxyamide CHEMBL424130
TypeSmall organic molecule
Emp. Form.C16H14Cl2N2O5S
Mol. Mass.417.264
SMILESONC(=O)C1N(CCc2cc(O)ccc12)S(=O)(=O)c1cc(Cl)ccc1Cl