Reaction Details
TargetMacrophage metalloelastase
LigandBDBM50137280
Substrate/Competitorn/a
Meas. Tech.ChEBML_106462
IC50 931.0±n/a nM
Citation Ma, DWu, WYang, GLi, JLi, JYe, Q Tetrahydroisoquinoline based sulfonamide hydroxamates as potent matrix metalloproteinase inhibitors. Bioorg Med Chem Lett14:47-50 (2003) Macrophage metalloelastase
Name:Macrophage metalloelastase
Type:Enzyme
Mol. Mass.:54012.99
Organism:Homo sapiens (Human)
Description:P39900
Residue:470
BDBM50137280
NameBDBM50137280
Synonyms:6-Benzyloxy-2-(2,5-dichloro-benzenesulfonyl)-1,2,3,4-tetrahydro-isoquinoline-1-carboxylic acid hydroxyamide | CHEMBL147604
TypeSmall organic molecule
Emp. Form.C23H20Cl2N2O5S
Mol. Mass.507.386
SMILESONC(=O)C1N(CCc2cc(OCc3ccccc3)ccc12)S(=O)(=O)c1cc(Cl)ccc1Cl