Reaction Details
TargetMatrilysin
LigandBDBM50137276
Substrate/Competitorn/a
Meas. Tech.ChEBML_105059
IC50 3192±n/a nM
Citation Ma, DWu, WYang, GLi, JLi, JYe, Q Tetrahydroisoquinoline based sulfonamide hydroxamates as potent matrix metalloproteinase inhibitors. Bioorg Med Chem Lett14:47-50 (2003) Matrilysin
Name:Matrilysin
Type:Enzyme
Mol. Mass.:29681.54
Organism:Homo sapiens (Human)
Description:P09237
Residue:267
BDBM50137276
NameBDBM50137276
Synonyms:6-Hydroxy-7-methoxy-2-(4-methoxy-benzenesulfonyl)-1,2,3,4-tetrahydro-isoquinoline-1-carboxylic acid hydroxyamide N,6-dihydroxy-7-methoxy-2-(4-methoxyphenylsulfonyl)-1,2,3,4-tetrahydroisoquinoline-1-carboxamide
TypeSmall organic molecule
Emp. Form.C18H20N2O7S
Mol. Mass.408.426
SMILESCOc1ccc(cc1)S(=O)(=O)N1CCc2cc(O)c(OC)cc2C1C(=O)NO