Reaction Details
TargetCathepsin K
LigandBDBM50137394
Substrate/Competitorn/a
Meas. Tech.ChEBML_48321
Ki 48±n/a nM
Citation Kim, TSHague, ABLee, TILian, BTegley, CMWang, XBurgess, TLQian, YXRoss, STagari, PLin, CHMayeda, CDao, JJordan, SMohr, CCheetham, JViswanadhan, VTasker, AS (4-Piperidinylphenyl)aminoethyl amides as a novel class of non-covalent cathepsin K inhibitors. Bioorg Med Chem Lett14:87-90 (2003) Cathepsin K
Name:Cathepsin K
Type:Enzyme
Mol. Mass.:36975.68
Organism:Homo sapiens (Human)
Description:P43235
Residue:329
BDBM50137394
NameBDBM50137394
Synonyms:((R)-2-(3H-Indol-3-yl)-1-{3-phenyl-1-[(4-piperidin-1-yl-phenylamino)-methyl]-propylcarbamoyl}-ethyl)-carbamic acid benzyl ester | CHEMBL354132
TypeSmall organic molecule
Emp. Form.C40H45N5O3
Mol. Mass.643.817
SMILESO=C(N[C@H](Cc1c[nH]c2ccccc12)C(=O)N[C@@H](CCc1ccccc1)CNc1ccc(cc1)N1CCCCC1)OCc1ccccc1