Reaction Details
TargetCathepsin K
LigandBDBM50137395
Substrate/Competitorn/a
Meas. Tech.ChEBML_48321
Ki 15±n/a nM
Citation Kim, TSHague, ABLee, TILian, BTegley, CMWang, XBurgess, TLQian, YXRoss, STagari, PLin, CHMayeda, CDao, JJordan, SMohr, CCheetham, JViswanadhan, VTasker, AS (4-Piperidinylphenyl)aminoethyl amides as a novel class of non-covalent cathepsin K inhibitors. Bioorg Med Chem Lett14:87-90 (2003) Cathepsin K
Name:Cathepsin K
Type:Enzyme
Mol. Mass.:36975.68
Organism:Homo sapiens (Human)
Description:P43235
Residue:329
BDBM50137395
NameBDBM50137395
Synonyms:CHEMBL170242 | {(S)-1-[(S)-1-Benzyl-2-(4-morpholin-4-yl-phenylamino)-ethylcarbamoyl]-3-methyl-butyl}-carbamic acid benzyl ester
TypeSmall organic molecule
Emp. Form.C33H42N4O4
Mol. Mass.558.711
SMILESCC(C)C[C@H](NC(=O)OCc1ccccc1)C(=O)N[C@H](CNc1ccc(cc1)N1CCOCC1)Cc1ccccc1