Reaction Details
TargetProcathepsin L
LigandBDBM50137386
Substrate/Competitorn/a
Meas. Tech.ChEBML_48367
Ki 7844.0±n/a nM
Citation Kim, TSHague, ABLee, TILian, BTegley, CMWang, XBurgess, TLQian, YXRoss, STagari, PLin, CHMayeda, CDao, JJordan, SMohr, CCheetham, JViswanadhan, VTasker, AS (4-Piperidinylphenyl)aminoethyl amides as a novel class of non-covalent cathepsin K inhibitors. Bioorg Med Chem Lett14:87-90 (2003) Procathepsin L
Name:Procathepsin L
Type:Enzyme
Mol. Mass.:37557.19
Organism:Homo sapiens (Human)
Description:Purchased from Calbiochem (San Diego, CA).
Residue:333
BDBM50137386
NameBDBM50137386
Synonyms:2-{(S)-3-Phenyl-1-[(4-piperidin-1-yl-phenylamino)-methyl]-propylcarbamoyl}-pyrrolidine-1-carboxylic acid benzyl ester | CHEMBL170962
TypeSmall organic molecule
Emp. Form.C34H42N4O3
Mol. Mass.554.7223
SMILESO=C(N[C@@H](CCc1ccccc1)CNc1ccc(cc1)N1CCCCC1)C1CCCN1C(=O)OCc1ccccc1