Reaction Details
TargetCathepsin K
LigandBDBM50137399
Substrate/Competitorn/a
Meas. Tech.ChEBML_48321
Ki>10000±n/a nM
Citation Kim, TSHague, ABLee, TILian, BTegley, CMWang, XBurgess, TLQian, YXRoss, STagari, PLin, CHMayeda, CDao, JJordan, SMohr, CCheetham, JViswanadhan, VTasker, AS (4-Piperidinylphenyl)aminoethyl amides as a novel class of non-covalent cathepsin K inhibitors. Bioorg Med Chem Lett14:87-90 (2003) Cathepsin K
Name:Cathepsin K
Type:Enzyme
Mol. Mass.:36975.68
Organism:Homo sapiens (Human)
Description:P43235
Residue:329
BDBM50137399
NameBDBM50137399
Synonyms:({3-Phenyl-1-[(4-piperidin-1-yl-phenylamino)-methyl]-propylcarbamoyl}-methyl)-carbamic acid benzyl ester | CHEMBL170814
TypeSmall organic molecule
Emp. Form.C31H38N4O3
Mol. Mass.514.6584
SMILESO=C(CNC(=O)OCc1ccccc1)N[C@@H](CCc1ccccc1)CNc1ccc(cc1)N1CCCCC1