Reaction Details
TargetCathepsin K
LigandBDBM50137401
Substrate/Competitorn/a
Meas. Tech.ChEBML_48321
Ki 706±n/a nM
Citation Kim, TSHague, ABLee, TILian, BTegley, CMWang, XBurgess, TLQian, YXRoss, STagari, PLin, CHMayeda, CDao, JJordan, SMohr, CCheetham, JViswanadhan, VTasker, AS (4-Piperidinylphenyl)aminoethyl amides as a novel class of non-covalent cathepsin K inhibitors. Bioorg Med Chem Lett14:87-90 (2003) Cathepsin K
Name:Cathepsin K
Type:Enzyme
Mol. Mass.:36975.68
Organism:Homo sapiens (Human)
Description:P43235
Residue:329
BDBM50137401
NameBDBM50137401
Synonyms:CHEMBL171998 | {(S)-1-[(S)-1-Benzyl-2-(biphenyl-4-ylamino)-ethylcarbamoyl]-3-methyl-butyl}-carbamic acid benzyl ester
TypeSmall organic molecule
Emp. Form.C35H39N3O3
Mol. Mass.549.7025
SMILESCC(C)C[C@H](NC(=O)OCc1ccccc1)C(=O)N[C@H](CNc1ccc(cc1)-c1ccccc1)Cc1ccccc1