Reaction Details
TargetGenome polyprotein
LigandBDBM50137462
Substrate/Competitorn/a
Meas. Tech.ChEBML_164133
IC50>500000±n/a nM
Citation Beaulieu, PLBös, MBousquet, YFazal, GGauthier, JGillard, JGoulet, SLaPlante, SPoupart, MALefebvre, SMcKercher, GPellerin, CAustel, VKukolj, G Non-nucleoside inhibitors of the hepatitis C virus NS5B polymerase: discovery and preliminary SAR of benzimidazole derivatives. Bioorg Med Chem Lett14:119-24 (2003) Genome polyprotein
Name:Genome polyprotein
Type:PROTEIN
Mol. Mass.:246555.04
Organism:Poliovirus type 1 (strain Mahoney)
Description:ChEMBL_417449
Residue:2209
BDBM50137462
NameBDBM50137462
Synonyms:1-Cyclohexyl-2-thiazol-2-yl-1H-benzoimidazole-5-carboxylic acid | CHEMBL434136
TypeSmall organic molecule
Emp. Form.C17H17N3O2S
Mol. Mass.327.401
SMILESOC(=O)c1ccc2n(C3CCCCC3)c(nc2c1)-c1nccs1