Reaction Details
TargetGenome polyprotein
LigandBDBM50137484
Substrate/Competitorn/a
Meas. Tech.ChEBML_164133
IC50>500000±n/a nM
Citation Beaulieu, PLBös, MBousquet, YFazal, GGauthier, JGillard, JGoulet, SLaPlante, SPoupart, MALefebvre, SMcKercher, GPellerin, CAustel, VKukolj, G Non-nucleoside inhibitors of the hepatitis C virus NS5B polymerase: discovery and preliminary SAR of benzimidazole derivatives. Bioorg Med Chem Lett14:119-24 (2003) Genome polyprotein
Name:Genome polyprotein
Type:PROTEIN
Mol. Mass.:246555.04
Organism:Poliovirus type 1 (strain Mahoney)
Description:ChEMBL_417449
Residue:2209
BDBM50137484
NameBDBM50137484
Synonyms:1-Cyclohexyl-2-(2-methyl-propenyl)-1H-benzoimidazole-5-carboxylic acid | CHEMBL173718
TypeSmall organic molecule
Emp. Form.C18H22N2O2
Mol. Mass.298.3795
SMILES[#6]\[#6](-[#6])=[#6]\c1nc2cc(ccc2n1-[#6]-1-[#6]-[#6]-[#6]-[#6]-[#6]-1)-[#6](-[#8])=O