Reaction Details
TargetProto-oncogene tyrosine-protein kinase Src
LigandBDBM50137572
Substrate/Competitorn/a
Meas. Tech.ChEMBL_202627 (CHEMBL805372)
IC50 200±n/a nM
Citation Guan, HLaird, ADBlake, RATang, CLiang, C Design and synthesis of aminopropyl tetrahydroindole-based indolin-2-ones as selective and potent inhibitors of Src and Yes tyrosine kinase. Bioorg Med Chem Lett14:187-90 (2003) Proto-oncogene tyrosine-protein kinase Src
Name:Proto-oncogene tyrosine-protein kinase Src
Type:Protein
Mol. Mass.:59838.60
Organism:Homo sapiens (Human)
Description:P12931
Residue:536
BDBM50137572
NameBDBM50137572
Synonyms:5-Ethanesulfonyl-3-[1-{3-[3-(4-methyl-piperazin-1-yl)-propyl]-4,5,6,7-tetrahydro-1H-indol-2-yl}-meth-(Z)-ylidene]-1,3-dihydro-indol-2-one | CHEMBL54283
TypeSmall organic molecule
Emp. Form.C27H36N4O3S
Mol. Mass.496.665
SMILESCCS(=O)(=O)c1ccc2NC(=O)\C(=C/c3[nH]c4CCCCc4c3CCCN3CCN(C)CC3)c2c1