Reaction Details
TargetTyrosine-protein kinase Lck
LigandBDBM50137573
Substrate/Competitorn/a
Meas. Tech.ChEBML_96912
IC50 100±n/a nM
Citation Guan, HLaird, ADBlake, RATang, CLiang, C Design and synthesis of aminopropyl tetrahydroindole-based indolin-2-ones as selective and potent inhibitors of Src and Yes tyrosine kinase. Bioorg Med Chem Lett14:187-90 (2003) Tyrosine-protein kinase Lck
Name:Tyrosine-protein kinase Lck
Type:n/a
Mol. Mass.:57987.83
Organism:Homo sapiens (Human)
Description:P06239
Residue:509
BDBM50137573
NameBDBM50137573
Synonyms:3-{2-[5-Methylsulfamoyl-2-oxo-1,2-dihydro-indol-(3Z)-ylidenemethyl]-4,5,6,7-tetrahydro-1H-indol-3-yl}-propionamide | CHEMBL56569
TypeSmall organic molecule
Emp. Form.C21H24N4O4S
Mol. Mass.428.505
SMILESCNS(=O)(=O)c1ccc2NC(=O)\C(=C/c3[nH]c4CCCCc4c3CCC(N)=O)c2c1