Reaction Details
TargetTyrosine-protein kinase Yes
LigandBDBM50137582
Substrate/Competitorn/a
Meas. Tech.ChEBML_217598
IC50 10±n/a nM
Citation Guan, HLaird, ADBlake, RATang, CLiang, C Design and synthesis of aminopropyl tetrahydroindole-based indolin-2-ones as selective and potent inhibitors of Src and Yes tyrosine kinase. Bioorg Med Chem Lett14:187-90 (2003) Tyrosine-protein kinase Yes
Name:Tyrosine-protein kinase Yes
Type:Protein
Mol. Mass.:60801.54
Organism:Homo sapiens (Human)
Description:P07947
Residue:543
BDBM50137582
NameBDBM50137582
Synonyms:CHEMBL292930 | [4-(3-{2-[5-Methylsulfamoyl-2-oxo-1,2-dihydro-indol-(3Z)-ylidenemethyl]-4,5,6,7-tetrahydro-1H-indol-3-yl}-propyl)-piperazin-1-yl]-acetic acid
TypeSmall organic molecule
Emp. Form.C27H35N5O5S
Mol. Mass.541.662
SMILESCNS(=O)(=O)c1ccc2NC(=O)\C(=C/c3[nH]c4CCCCc4c3CCCN3CCN(CC(O)=O)CC3)c2c1