Reaction Details
TargetTyrosine-protein kinase Fyn
LigandBDBM50137570
Substrate/Competitorn/a
Meas. Tech.ChEBML_69578
IC50 500±n/a nM
Citation Guan, HLaird, ADBlake, RATang, CLiang, C Design and synthesis of aminopropyl tetrahydroindole-based indolin-2-ones as selective and potent inhibitors of Src and Yes tyrosine kinase. Bioorg Med Chem Lett14:187-90 (2003) Tyrosine-protein kinase Fyn
Name:Tyrosine-protein kinase Fyn
Type:Enzyme
Mol. Mass.:60762.21
Organism:Homo sapiens (Human)
Description:P06241
Residue:537
BDBM50137570
NameBDBM50137570
Synonyms:CHEMBL291759 | [4-(3-{2-[5-Methylsulfamoyl-2-oxo-1,2-dihydro-indol-(3Z)-ylidenemethyl]-4,5,6,7-tetrahydro-1H-indol-3-yl}-propyl)-piperazin-1-yl]-acetic acid ethyl ester
TypeSmall organic molecule
Emp. Form.C29H39N5O5S
Mol. Mass.569.715
SMILESCCOC(=O)CN1CCN(CCCc2c3CCCCc3[nH]c2\C=C2/C(=O)Nc3ccc(cc23)S(=O)(=O)NC)CC1