Reaction Details
TargetProto-oncogene tyrosine-protein kinase Src
LigandBDBM50137609
Substrate/Competitorn/a
Meas. Tech.ChEBML_202627
IC50 400±n/a nM
Citation Guan, HLaird, ADBlake, RATang, CLiang, C Design and synthesis of aminopropyl tetrahydroindole-based indolin-2-ones as selective and potent inhibitors of Src and Yes tyrosine kinase. Bioorg Med Chem Lett14:187-90 (2003) Proto-oncogene tyrosine-protein kinase Src
Name:Proto-oncogene tyrosine-protein kinase Src
Type:Protein
Mol. Mass.:59838.60
Organism:Homo sapiens (Human)
Description:P12931
Residue:536
BDBM50137609
NameBDBM50137609
Synonyms:3-[1-(3-{3-[4-(2-Hydroxy-acetyl)-piperazin-1-yl]-propyl}-4,5,6,7-tetrahydro-1H-indol-2-yl)-meth-(Z)-ylidene]-2-oxo-2,3-dihydro-1H-indole-5-sulfonic acid methylamide | CHEMBL291914
TypeSmall organic molecule
Emp. Form.C27H35N5O5S
Mol. Mass.541.662
SMILESCNS(=O)(=O)c1ccc2NC(=O)\C(=C/c3[nH]c4CCCCc4c3CCCN3CCN(CC3)C(=O)CO)c2c1