Reaction Details
TargetFibroblast growth factor receptor 1
LigandBDBM50137570
Substrate/Competitorn/a
Meas. Tech.ChEBML_70625
IC50 80±n/a nM
Citation Guan, HLaird, ADBlake, RATang, CLiang, C Design and synthesis of aminopropyl tetrahydroindole-based indolin-2-ones as selective and potent inhibitors of Src and Yes tyrosine kinase. Bioorg Med Chem Lett14:187-90 (2003) Fibroblast growth factor receptor 1
Name:Fibroblast growth factor receptor 1
Type:Receptor
Mol. Mass.:91861.70
Organism:Homo sapiens (Human)
Description:P11362
Residue:822
BDBM50137570
NameBDBM50137570
Synonyms:CHEMBL291759 | [4-(3-{2-[5-Methylsulfamoyl-2-oxo-1,2-dihydro-indol-(3Z)-ylidenemethyl]-4,5,6,7-tetrahydro-1H-indol-3-yl}-propyl)-piperazin-1-yl]-acetic acid ethyl ester
TypeSmall organic molecule
Emp. Form.C29H39N5O5S
Mol. Mass.569.715
SMILESCCOC(=O)CN1CCN(CCCc2c3CCCCc3[nH]c2\C=C2/C(=O)Nc3ccc(cc23)S(=O)(=O)NC)CC1