Reaction Details
TargetProto-oncogene tyrosine-protein kinase Src
LigandBDBM50137614
Substrate/Competitorn/a
Meas. Tech.ChEBML_202627
IC50 200±n/a nM
Citation Guan, HLaird, ADBlake, RATang, CLiang, C Design and synthesis of aminopropyl tetrahydroindole-based indolin-2-ones as selective and potent inhibitors of Src and Yes tyrosine kinase. Bioorg Med Chem Lett14:187-90 (2003) Proto-oncogene tyrosine-protein kinase Src
Name:Proto-oncogene tyrosine-protein kinase Src
Type:Protein
Mol. Mass.:59838.60
Organism:Homo sapiens (Human)
Description:P12931
Residue:536
BDBM50137614
NameBDBM50137614
Synonyms:2-Oxo-3-[1-[3-(3-piperazin-1-yl-propyl)-4,5,6,7-tetrahydro-1H-indol-2-yl]-meth-(Z)-ylidene]-2,3-dihydro-1H-indole-5-sulfonic acid methylamide | CHEMBL55410
TypeSmall organic molecule
Emp. Form.C25H33N5O3S
Mol. Mass.483.626
SMILESCNS(=O)(=O)c1ccc2NC(=O)\C(=C/c3[nH]c4CCCCc4c3CCCN3CCNCC3)c2c1