Reaction Details
TargetFibroblast growth factor receptor 1
LigandBDBM50137569
Substrate/Competitorn/a
Meas. Tech.ChEBML_70625
IC50 80±n/a nM
Citation Guan, HLaird, ADBlake, RATang, CLiang, C Design and synthesis of aminopropyl tetrahydroindole-based indolin-2-ones as selective and potent inhibitors of Src and Yes tyrosine kinase. Bioorg Med Chem Lett14:187-90 (2003) Fibroblast growth factor receptor 1
Name:Fibroblast growth factor receptor 1
Type:Receptor
Mol. Mass.:91861.70
Organism:Homo sapiens (Human)
Description:P11362
Residue:822
BDBM50137569
NameBDBM50137569
Synonyms:3-{2-[5-Ethanesulfonyl-2-oxo-1,2-dihydro-indol-(3Z)-ylidenemethyl]-4,5,6,7-tetrahydro-1H-indol-3-yl}-propionamide | CHEMBL301271
TypeSmall organic molecule
Emp. Form.C22H25N3O4S
Mol. Mass.427.517
SMILESCCS(=O)(=O)c1ccc2NC(=O)\C(=C/c3[nH]c4CCCCc4c3CCC(N)=O)c2c1