Reaction Details
TargetD(2) dopamine receptor
LigandBDBM50137618
Substrate/Competitorn/a
Meas. Tech.ChEBML_62232
Ki 2200±n/a nM
Citation Mach, RHHuang, YFreeman, RAWu, LVangveravong, SLuedtke, RR Conformationally-flexible benzamide analogues as dopamine D3 and sigma 2 receptor ligands. Bioorg Med Chem Lett14:195-202 (2003) D(2) dopamine receptor
Name:D(2) dopamine receptor
Type:G Protein-Coupled Receptor (GPCR)
Mol. Mass.:50931.60
Organism:Rattus norvegicus (rat)
Description:P61169
Residue:444
BDBM50137618
NameBDBM50137618
Synonyms:5-Bromo-N-[4-(6,7-dimethoxy-3,4-dihydro-1H-isoquinolin-2-yl)-butyl]-2,3-dimethoxy-benzamide CHEMBL291439
TypeSmall organic molecule
Emp. Form.C24H31BrN2O5
Mol. Mass.507.417
SMILESCOc1cc2CCN(CCCCNC(=O)c3cc(Br)cc(OC)c3OC)Cc2cc1OC