Reaction Details
TargetGenome polyprotein
LigandBDBM50137721
Substrate/Competitorn/a
Meas. Tech.ChEMBL_161069 (CHEMBL771843)
Ki 68±n/a nM
Citation Yip, YVictor, FLamar, JJohnson, RWang, QMBarket, DGlass, JJin, LLiu, LVenable, DWakulchik, MXie, CHeinz, BVillarreal, EColacino, JYumibe, NTebbe, MMunroe, JChen, SH Discovery of a novel bicycloproline P2 bearing peptidyl alpha-ketoamide LY514962 as HCV protease inhibitor. Bioorg Med Chem Lett14:251-6 (2003) Genome polyprotein
Name:Genome polyprotein
Type:PROTEIN
Mol. Mass.:44361.04
Organism:Human rhinovirus B
Description:ChEMBL_158953
Residue:401
BDBM50137721
NameBDBM50137721
Synonyms:2-(3-{[(1S,5S,6R)-2-((S)-3-Methyl-2-{(S)-3-methyl-2-[(pyrazine-2-carbonyl)-amino]-butyrylamino}-butyryl)-octahydro-cyclopenta[c]pyrrole-1-carbonyl]-amino}-2-oxo-hexanoylamino)-3-phenyl-propionic acid | CHEMBL313670
TypeSmall organic molecule
Emp. Form.C38H51N7O8
Mol. Mass.733.8536
SMILESCCCC(NC(=O)[C@@H]1[C@H]2CCC[C@H]2CN1C(=O)[C@@H](NC(=O)[C@@H](NC(=O)c1cnccn1)C(C)C)C(C)C)C(=O)C(=O)N[C@@H](Cc1ccccc1)C(O)=O