Reaction Details
TargetProcathepsin L
LigandBDBM50137720
Substrate/Competitorn/a
Meas. Tech.ChEBML_48523
Ki 12±n/a nM
Citation Victor, FLamar, JSnyder, NYip, YGuo, DYumibe, NJohnson, RBWang, QMGlass, JIChen, SH P1 and P3 optimization of novel bicycloproline P2 bearing tetrapeptidyl alpha-ketoamide based HCV protease inhibitors. Bioorg Med Chem Lett14:257-61 (2003) Procathepsin L
Name:Procathepsin L
Type:Enzyme
Mol. Mass.:37557.19
Organism:Homo sapiens (Human)
Description:Purchased from Calbiochem (San Diego, CA).
Residue:333
BDBM50137720
NameBDBM50137720
Synonyms:(1S,3aR,6aS)-2-((S)-3-Methyl-2-{(S)-3-methyl-2-[(pyrazine-2-carbonyl)-amino]-butyrylamino}-butyryl)-octahydro-cyclopenta[c]pyrrole-1-carboxylic acid (1-cyclopropylaminooxalyl-butyl)-amide CHEMBL264623
TypeSmall organic molecule
Emp. Form.C32H47N7O6
Mol. Mass.625.7589
SMILESCCCC(NC(=O)[C@@H]1[C@H]2CCC[C@H]2CN1C(=O)[C@@H](NC(=O)[C@@H](NC(=O)c1cnccn1)C(C)C)C(C)C)C(=O)C(=O)NC1CC1