Reaction Details
TargetHistone deacetylase 1
LigandBDBM50137828
Substrate/Competitorn/a
Meas. Tech.ChEBML_87538
IC50 500±n/a nM
Citation Vaisburg, ABernstein, NFrechette, SAllan, MAbou-Khalil, ELeit, SMoradei, OBouchain, GWang, JWoo, SHFournel, MYan, PTTrachy-Bourget, MCKalita, ABeaulieu, CLi, ZMacLeod, ARBesterman, JMDelorme, D (2-amino-phenyl)-amides of omega-substituted alkanoic acids as new histone deacetylase inhibitors. Bioorg Med Chem Lett14:283-7 (2003) Histone deacetylase 1
Name:Histone deacetylase 1
Type:Enzyme
Mol. Mass.:55090.27
Organism:Homo sapiens (Human)
Description:Q13547
Residue:482
BDBM50137828
NameBDBM50137828
Synonyms:6-(5-Hydroxy-6-morpholin-4-ylmethyl-1,3-dioxo-1H,3H-benzo[de]isoquinolin-2-yl)-hexanoic acid (2-amino-phenyl)-amide | CHEMBL97629
TypeSmall organic molecule
Emp. Form.C29H32N4O5
Mol. Mass.516.5882
SMILESNc1ccccc1NC(=O)CCCCCN1C(=O)c2cccc3c(CN4CCOCC4)c(O)cc(C1=O)c23