Reaction Details
TargetRNA-directed RNA polymerase
LigandBDBM50115572
Substrate/Competitorn/a
Meas. Tech.ChEBML_163993
IC50 8000±n/a nM
Citation Summa, VPetrocchi, APace, PMatassa, VGDe Francesco, RAltamura, STomei, LKoch, UNeuner, P Discovery of alpha,gamma-diketo acids as potent selective and reversible inhibitors of hepatitis C virus NS5b RNA-dependent RNA polymerase. J Med Chem47:14-7 (2003) 
 
RNA-directed RNA polymerase
Name:RNA-directed RNA polymerase
Type:Protein
Mol. Mass.:25173.95
Organism:Hepatitis C virus
Description:Q8JXU8
Residue:229
BDBM50115572
NameBDBM50115572
Synonyms:(Z)-4-(3-Benzyloxy-phenyl)-2-hydroxy-4-oxo-but-2-enoic acid CHEMBL108253 CHEMBL492770
TypeSmall organic molecule
Emp. Form.C17H14O5
Mol. Mass.298.2901
SMILESOC(=O)C(=O)CC(=O)c1cccc(OCc2ccccc2)c1