Reaction Details
TargetRNA-directed RNA polymerase
LigandBDBM50137880
Substrate/Competitorn/a
Meas. Tech.ChEBML_163993
IC50>50000±n/a nM
Citation Summa, VPetrocchi, APace, PMatassa, VGDe Francesco, RAltamura, STomei, LKoch, UNeuner, P Discovery of alpha,gamma-diketo acids as potent selective and reversible inhibitors of hepatitis C virus NS5b RNA-dependent RNA polymerase. J Med Chem47:14-7 (2003) 
 
RNA-directed RNA polymerase
Name:RNA-directed RNA polymerase
Type:Protein
Mol. Mass.:25173.95
Organism:Hepatitis C virus
Description:Q8JXU8
Residue:229
BDBM50137880
NameBDBM50137880
Synonyms:4-Furan-2-yl-2,4-dioxo-butyric acid CHEMBL199039
TypeSmall organic molecule
Emp. Form.C8H6O5
Mol. Mass.182.1302
SMILESOC(=O)C(=O)CC(=O)c1ccco1