Reaction Details
TargetRNA-directed RNA polymerase
LigandBDBM50137860
Substrate/Competitorn/a
Meas. Tech.ChEBML_163993
IC50>50000±n/a nM
Citation Summa, VPetrocchi, APace, PMatassa, VGDe Francesco, RAltamura, STomei, LKoch, UNeuner, P Discovery of alpha,gamma-diketo acids as potent selective and reversible inhibitors of hepatitis C virus NS5b RNA-dependent RNA polymerase. J Med Chem47:14-7 (2003) 
 
RNA-directed RNA polymerase
Name:RNA-directed RNA polymerase
Type:Protein
Mol. Mass.:25173.95
Organism:Hepatitis C virus
Description:Q8JXU8
Residue:229
BDBM50137860
NameBDBM50137860
Synonyms:2,4-dioxopentanoic acid Acetylpyruvate CHEMBL46789 | acetylpyruvic acid
TypeSmall organic molecule
Emp. Form.C5H6O4
Mol. Mass.130.0987
SMILESCC(=O)CC(=O)C(O)=O