Reaction Details
TargetRNA-directed RNA polymerase
LigandBDBM50137875
Substrate/Competitorn/a
Meas. Tech.ChEBML_163993
IC50 350±n/a nM
Citation Summa, VPetrocchi, APace, PMatassa, VGDe Francesco, RAltamura, STomei, LKoch, UNeuner, P Discovery of alpha,gamma-diketo acids as potent selective and reversible inhibitors of hepatitis C virus NS5b RNA-dependent RNA polymerase. J Med Chem47:14-7 (2003) 
 
RNA-directed RNA polymerase
Name:RNA-directed RNA polymerase
Type:Protein
Mol. Mass.:25173.95
Organism:Hepatitis C virus
Description:Q8JXU8
Residue:229
BDBM50137875
NameBDBM50137875
Synonyms:4-[2-(3-Cyano-propoxy)-phenyl]-2,4-dioxo-butyric acid CHEMBL175171 | CHEMBL196154
TypeSmall organic molecule
Emp. Form.C14H13NO5
Mol. Mass.275.2567
SMILESOC(=O)C(=O)CC(=O)c1ccccc1OCCCC#N