Reaction Details
TargetRNA-directed RNA polymerase
LigandBDBM50115579
Substrate/Competitorn/a
Meas. Tech.ChEBML_163993
IC50 5700±n/a nM
Citation Summa, VPetrocchi, APace, PMatassa, VGDe Francesco, RAltamura, STomei, LKoch, UNeuner, P Discovery of alpha,gamma-diketo acids as potent selective and reversible inhibitors of hepatitis C virus NS5b RNA-dependent RNA polymerase. J Med Chem47:14-7 (2003) 
 
RNA-directed RNA polymerase
Name:RNA-directed RNA polymerase
Type:Protein
Mol. Mass.:25173.95
Organism:Hepatitis C virus
Description:Q8JXU8
Residue:229
BDBM50115579
NameBDBM50115579
Synonyms:(Z)-2-hydroxy-4-oxo-4-phenyl-but-2-enoic acid 2-Hydroxy-4-oxo-4-phenyl-but-2-enoic acid (0.25H2O) CHEMBL19332 Sacchettini_CTRL
TypeSmall organic molecule
Emp. Form.C10H8O4
Mol. Mass.192.1681
SMILESOC(=O)C(=O)CC(=O)c1ccccc1