Reaction Details
TargetRNA-directed RNA polymerase
LigandBDBM50137877
Substrate/Competitorn/a
Meas. Tech.ChEBML_163993
IC50>50000±n/a nM
Citation Summa, VPetrocchi, APace, PMatassa, VGDe Francesco, RAltamura, STomei, LKoch, UNeuner, P Discovery of alpha,gamma-diketo acids as potent selective and reversible inhibitors of hepatitis C virus NS5b RNA-dependent RNA polymerase. J Med Chem47:14-7 (2003) 
 
RNA-directed RNA polymerase
Name:RNA-directed RNA polymerase
Type:Protein
Mol. Mass.:25173.95
Organism:Hepatitis C virus
Description:Q8JXU8
Residue:229
BDBM50137877
NameBDBM50137877
Synonyms:4-(4-tert-Butyl-phenyl)-2,4-dioxo-butyric acid CHEMBL177776
TypeSmall organic molecule
Emp. Form.C14H16O4
Mol. Mass.248.2744
SMILESCC(C)(C)c1ccc(cc1)C(=O)CC(=O)C(O)=O