Reaction Details
TargetRNA-directed RNA polymerase
LigandBDBM50137871
Substrate/Competitorn/a
Meas. Tech.ChEBML_163993
IC50>50000±n/a nM
Citation Summa, VPetrocchi, APace, PMatassa, VGDe Francesco, RAltamura, STomei, LKoch, UNeuner, P Discovery of alpha,gamma-diketo acids as potent selective and reversible inhibitors of hepatitis C virus NS5b RNA-dependent RNA polymerase. J Med Chem47:14-7 (2003) 
 
RNA-directed RNA polymerase
Name:RNA-directed RNA polymerase
Type:Protein
Mol. Mass.:25173.95
Organism:Hepatitis C virus
Description:Q8JXU8
Residue:229
BDBM50137871
NameBDBM50137871
Synonyms:2,4-Dioxo-5,5-diphenyl-pentanoic acid | CHEMBL177767
TypeSmall organic molecule
Emp. Form.C17H14O4
Mol. Mass.282.2907
SMILESOC(=O)C(=O)CC(=O)C(c1ccccc1)c1ccccc1