Reaction Details
TargetRNA-directed RNA polymerase
LigandBDBM50137859
Substrate/Competitorn/a
Meas. Tech.ChEBML_163993
IC50>50000±n/a nM
Citation Summa, VPetrocchi, APace, PMatassa, VGDe Francesco, RAltamura, STomei, LKoch, UNeuner, P Discovery of alpha,gamma-diketo acids as potent selective and reversible inhibitors of hepatitis C virus NS5b RNA-dependent RNA polymerase. J Med Chem47:14-7 (2003) 
 
RNA-directed RNA polymerase
Name:RNA-directed RNA polymerase
Type:Protein
Mol. Mass.:25173.95
Organism:Hepatitis C virus
Description:Q8JXU8
Residue:229
BDBM50137859
NameBDBM50137859
Synonyms:5,5-Dimethyl-2,4-dioxo-hexanoic acid CHEMBL178016
TypeSmall organic molecule
Emp. Form.C8H12O4
Mol. Mass.172.1785
SMILESCC(C)(C)C(=O)CC(=O)C(O)=O