Reaction Details
TargetReplication protein E1
LigandBDBM50137882
Substrate/Competitorn/a
Meas. Tech.ChEBML_84985
IC50 3300±n/a nM
Citation Faucher, AMWhite, PWBrochu, CGrand-Maître, CRancourt, JFazal, G Discovery of small-molecule inhibitors of the ATPase activity of human papillomavirus E1 helicase. J Med Chem47:18-21 (2003) 
 
Replication protein E1
Name:Replication protein E1
Type:PROTEIN
Mol. Mass.:73515.58
Organism:Human papillomavirus type 11
Description:ChEMBL_84985
Residue:649
BDBM50137882
NameBDBM50137882
Synonyms:CHEMBL368466 | [4'-(Piperidine-1-carbonyl)-biphenyl-4-sulfonyl]-acetic acid
TypeSmall organic molecule
Emp. Form.C20H21NO5S
Mol. Mass.387.449
SMILESOC(=O)CS(=O)(=O)c1ccc(cc1)-c1ccc(cc1)C(=O)N1CCCCC1