Reaction Details
TargetReplication protein E1
LigandBDBM50137888
Substrate/Competitorn/a
Meas. Tech.ChEBML_84985
IC50 30000±n/a nM
Citation Faucher, AMWhite, PWBrochu, CGrand-Maître, CRancourt, JFazal, G Discovery of small-molecule inhibitors of the ATPase activity of human papillomavirus E1 helicase. J Med Chem47:18-21 (2003) 
 
Replication protein E1
Name:Replication protein E1
Type:PROTEIN
Mol. Mass.:73515.58
Organism:Human papillomavirus type 11
Description:ChEMBL_84985
Residue:649
BDBM50137888
NameBDBM50137888
Synonyms:CHEMBL368316 | [4-(2-Methyl-thiazol-4-yl)-benzenesulfonyl]-acetic acid
TypeSmall organic molecule
Emp. Form.C12H11NO4S2
Mol. Mass.297.35
SMILESCc1nc(cs1)-c1ccc(cc1)S(=O)(=O)CC(O)=O