Reaction Details
TargetReplication protein E1
LigandBDBM50137893
Substrate/Competitorn/a
Meas. Tech.ChEBML_84985
IC50 22000±n/a nM
Citation Faucher, AMWhite, PWBrochu, CGrand-Maître, CRancourt, JFazal, G Discovery of small-molecule inhibitors of the ATPase activity of human papillomavirus E1 helicase. J Med Chem47:18-21 (2003) 
 
Replication protein E1
Name:Replication protein E1
Type:PROTEIN
Mol. Mass.:73515.58
Organism:Human papillomavirus type 11
Description:ChEMBL_84985
Residue:649
BDBM50137893
NameBDBM50137893
Synonyms:CHEMBL174590 | [3'-(Morpholine-4-carbonyl)-biphenyl-4-sulfonyl]-acetic acid
TypeSmall organic molecule
Emp. Form.C19H19NO6S
Mol. Mass.389.422
SMILESOC(=O)CS(=O)(=O)c1ccc(cc1)-c1cccc(c1)C(=O)N1CCOCC1