Reaction Details
TargetReplication protein E1
LigandBDBM50137897
Substrate/Competitorn/a
Meas. Tech.ChEBML_84985
IC50 110±n/a nM
Citation Faucher, AMWhite, PWBrochu, CGrand-Maître, CRancourt, JFazal, G Discovery of small-molecule inhibitors of the ATPase activity of human papillomavirus E1 helicase. J Med Chem47:18-21 (2003) 
 
Replication protein E1
Name:Replication protein E1
Type:PROTEIN
Mol. Mass.:73515.58
Organism:Human papillomavirus type 11
Description:ChEMBL_84985
Residue:649
BDBM50137897
NameBDBM50137897
Synonyms:(3'-Phenylcarbamoylmethyl-biphenyl-4-sulfonyl)-acetic acid {3'-[(phenylcarbamoyl)-methyl]-biphenyl-4-sulfonyl}-acetic acid
TypeSmall organic molecule
Emp. Form.C22H19NO5S
Mol. Mass.409.455
SMILESOC(=O)CS(=O)(=O)c1ccc(cc1)-c1cccc(CC(=O)Nc2ccccc2)c1