Reaction Details
TargetReplication protein E1
LigandBDBM50137899
Substrate/Competitorn/a
Meas. Tech.ChEBML_84985
IC50 27±n/a nM
Citation Faucher, AMWhite, PWBrochu, CGrand-Maître, CRancourt, JFazal, G Discovery of small-molecule inhibitors of the ATPase activity of human papillomavirus E1 helicase. J Med Chem47:18-21 (2003) 
 
Replication protein E1
Name:Replication protein E1
Type:PROTEIN
Mol. Mass.:73515.58
Organism:Human papillomavirus type 11
Description:ChEMBL_84985
Residue:649
BDBM50137899
NameBDBM50137899
Synonyms:CHEMBL175280 | [3'-(3-methyl-benzylcarbamoyl)-biphenyl-4-sulfonyl]-acetic acid
TypeSmall organic molecule
Emp. Form.C23H21NO5S
Mol. Mass.423.482
SMILESCc1cccc(CNC(=O)c2cccc(c2)-c2ccc(cc2)S(=O)(=O)CC(O)=O)c1