Reaction Details
TargetReplication protein E1
LigandBDBM50137913
Substrate/Competitorn/a
Meas. Tech.ChEBML_84985
IC50 40000±n/a nM
Citation Faucher, AMWhite, PWBrochu, CGrand-Maître, CRancourt, JFazal, G Discovery of small-molecule inhibitors of the ATPase activity of human papillomavirus E1 helicase. J Med Chem47:18-21 (2003) 
 
Replication protein E1
Name:Replication protein E1
Type:PROTEIN
Mol. Mass.:73515.58
Organism:Human papillomavirus type 11
Description:ChEMBL_84985
Residue:649
BDBM50137913
NameBDBM50137913
Synonyms:(Naphthalene-2-sulfonyl)-acetic acid | CHEMBL174983
TypeSmall organic molecule
Emp. Form.C12H10O4S
Mol. Mass.250.27
SMILESOC(=O)CS(=O)(=O)c1ccc2ccccc2c1