Reaction Details
TargetReplication protein E1
LigandBDBM50137918
Substrate/Competitorn/a
Meas. Tech.ChEBML_84985
IC50>80000±n/a nM
Citation Faucher, AMWhite, PWBrochu, CGrand-Maître, CRancourt, JFazal, G Discovery of small-molecule inhibitors of the ATPase activity of human papillomavirus E1 helicase. J Med Chem47:18-21 (2003) 
 
Replication protein E1
Name:Replication protein E1
Type:PROTEIN
Mol. Mass.:73515.58
Organism:Human papillomavirus type 11
Description:ChEMBL_84985
Residue:649
BDBM50137918
NameBDBM50137918
Synonyms:(Biphenyl-3-sulfonyl)-acetic acid | CHEMBL367951
TypeSmall organic molecule
Emp. Form.C14H12O4S
Mol. Mass.276.308
SMILESOC(=O)CS(=O)(=O)c1cccc(c1)-c1ccccc1