Reaction Details
TargetReplication protein E1
LigandBDBM50137930
Substrate/Competitorn/a
Meas. Tech.ChEBML_84985
IC50 63000±n/a nM
Citation Faucher, AMWhite, PWBrochu, CGrand-Maître, CRancourt, JFazal, G Discovery of small-molecule inhibitors of the ATPase activity of human papillomavirus E1 helicase. J Med Chem47:18-21 (2003) 
 
Replication protein E1
Name:Replication protein E1
Type:PROTEIN
Mol. Mass.:73515.58
Organism:Human papillomavirus type 11
Description:ChEMBL_84985
Residue:649
BDBM50137930
NameBDBM50137930
Synonyms:4-Nitromethanesulfonyl-biphenyl CHEMBL173733
TypeSmall organic molecule
Emp. Form.C14H12N4O2S
Mol. Mass.300.336
SMILESO=S(=O)(Cc1nnn[nH]1)c1ccc(cc1)-c1ccccc1