Reaction Details
TargetReplication protein E1
LigandBDBM50137927
Substrate/Competitorn/a
Meas. Tech.ChEBML_84985
IC50 1100±n/a nM
Citation Faucher, AMWhite, PWBrochu, CGrand-Maître, CRancourt, JFazal, G Discovery of small-molecule inhibitors of the ATPase activity of human papillomavirus E1 helicase. J Med Chem47:18-21 (2003) 
 
Replication protein E1
Name:Replication protein E1
Type:PROTEIN
Mol. Mass.:73515.58
Organism:Human papillomavirus type 11
Description:ChEMBL_84985
Residue:649
BDBM50137927
NameBDBM50137927
Synonyms:(4'-Dibenzylcarbamoyl-biphenyl-4-sulfonyl)-acetic acid | CHEMBL176771
TypeSmall organic molecule
Emp. Form.C29H25NO5S
Mol. Mass.499.578
SMILESOC(=O)CS(=O)(=O)c1ccc(cc1)-c1ccc(cc1)C(=O)N(Cc1ccccc1)Cc1ccccc1