Reaction Details
TargetReplication protein E1
LigandBDBM50137931
Substrate/Competitorn/a
Meas. Tech.ChEBML_84985
IC50 5400±n/a nM
Citation Faucher, AMWhite, PWBrochu, CGrand-Maître, CRancourt, JFazal, G Discovery of small-molecule inhibitors of the ATPase activity of human papillomavirus E1 helicase. J Med Chem47:18-21 (2003) 
 
Replication protein E1
Name:Replication protein E1
Type:PROTEIN
Mol. Mass.:73515.58
Organism:Human papillomavirus type 11
Description:ChEMBL_84985
Residue:649
BDBM50137931
NameBDBM50137931
Synonyms:(4-Naphthalen-1-yl-benzenesulfonyl)-acetic acid | CHEMBL177214
TypeSmall organic molecule
Emp. Form.C18H14O4S
Mol. Mass.326.366
SMILESOC(=O)CS(=O)(=O)c1ccc(cc1)-c1cccc2ccccc12