Reaction Details
TargetVasopressin V2 receptor
LigandBDBM50137942
Substrate/Competitorn/a
Meas. Tech.ChEBML_214714
IC50 30±n/a nM
Citation Cho, HMurakami, KNakanishi, HFujisawa, AIsoshima, HNiwa, MHayakawa, KHase, YUchida, IWatanabe, HWakitani, KAisaka, K Synthesis and structure-activity relationships of 5,6,7,8-tetrahydro-4H-thieno[3,2-b]azepine derivatives: novel arginine vasopressin antagonists. J Med Chem47:101-9 (2003) 
 
Vasopressin V2 receptor
Name:Vasopressin V2 receptor
Type:Receptor
Mol. Mass.:40295.28
Organism:Homo sapiens (Human)
Description:P30518
Residue:371
BDBM50137942
NameBDBM50137942
Synonyms:Biphenyl-2-carboxylic acid [2-(4-[1,4']bipiperidinyl-1'-yl-4-oxo-butoxy)-4-(5,6,7,8-tetrahydro-thieno[3,2-b]azepine-4-carbonyl)-phenyl]-amide | CHEMBL368353
TypeSmall organic molecule
Emp. Form.C42H48N4O4S
Mol. Mass.704.92
SMILESO=C(CCCOc1cc(ccc1NC(=O)c1ccccc1-c1ccccc1)C(=O)N1CCCCc2sccc12)N1CCC(CC1)N1CCCCC1