Reaction Details
TargetVasopressin V2 receptor
LigandBDBM50137956
Substrate/Competitorn/a
Meas. Tech.ChEBML_215011
IC50 1±n/a nM
Citation Cho, HMurakami, KNakanishi, HFujisawa, AIsoshima, HNiwa, MHayakawa, KHase, YUchida, IWatanabe, HWakitani, KAisaka, K Synthesis and structure-activity relationships of 5,6,7,8-tetrahydro-4H-thieno[3,2-b]azepine derivatives: novel arginine vasopressin antagonists. J Med Chem47:101-9 (2003) 
 
Vasopressin V2 receptor
Name:Vasopressin V2 receptor
Type:G-protein coupled receptor
Mol. Mass.:40761.85
Organism:Rattus norvegicus (Rat)
Description:n/a
Residue:371
BDBM50137956
NameBDBM50137956
Synonyms:Biphenyl-2-carboxylic acid [2-[4-(4-methyl-piperazin-1-yl)-4-oxo-butoxy]-4-(5,6,7,8-tetrahydro-thieno[3,2-b]azepine-4-carbonyl)-phenyl]-amide | CHEMBL413748
TypeSmall organic molecule
Emp. Form.C37H40N4O4S
Mol. Mass.636.803
SMILESCN1CCN(CC1)C(=O)CCCOc1cc(ccc1NC(=O)c1ccccc1-c1ccccc1)C(=O)N1CCCCc2sccc12