Reaction Details
TargetVasopressin V2 receptor
LigandBDBM50137954
Substrate/Competitorn/a
Meas. Tech.ChEBML_215011
IC50 20±n/a nM
Citation Cho, HMurakami, KNakanishi, HFujisawa, AIsoshima, HNiwa, MHayakawa, KHase, YUchida, IWatanabe, HWakitani, KAisaka, K Synthesis and structure-activity relationships of 5,6,7,8-tetrahydro-4H-thieno[3,2-b]azepine derivatives: novel arginine vasopressin antagonists. J Med Chem47:101-9 (2003) 
 
Vasopressin V2 receptor
Name:Vasopressin V2 receptor
Type:G-protein coupled receptor
Mol. Mass.:40761.85
Organism:Rattus norvegicus (Rat)
Description:n/a
Residue:371
BDBM50137954
NameBDBM50137954
Synonyms:Biphenyl-2-carboxylic acid {4-[8-(2-dimethylamino-ethyl)-5,6,7,8-tetrahydro-1-thia-4,8-diaza-azulene-4-carbonyl]-phenyl}-amide | CHEMBL435331
TypeSmall organic molecule
Emp. Form.C31H32N4O2S
Mol. Mass.524.676
SMILESCN(C)CCN1CCCN(C(=O)c2ccc(NC(=O)c3ccccc3-c3ccccc3)cc2)c2ccsc12