Reaction Details
TargetVasopressin V2 receptor
LigandBDBM50137948
Substrate/Competitorn/a
Meas. Tech.ChEMBL_215011 (CHEMBL818809)
IC50<1±n/a nM
Citation Cho, HMurakami, KNakanishi, HFujisawa, AIsoshima, HNiwa, MHayakawa, KHase, YUchida, IWatanabe, HWakitani, KAisaka, K Synthesis and structure-activity relationships of 5,6,7,8-tetrahydro-4H-thieno[3,2-b]azepine derivatives: novel arginine vasopressin antagonists. J Med Chem47:101-9 (2003) 
 
Vasopressin V2 receptor
Name:Vasopressin V2 receptor
Type:G-protein coupled receptor
Mol. Mass.:40761.85
Organism:Rattus norvegicus (Rat)
Description:n/a
Residue:371
BDBM50137948
NameBDBM50137948
Synonyms:Biphenyl-2-carboxylic acid [2-[3-(4-methyl-[1,4]diazepan-1-yl)-propoxy]-4-(5,6,7,8-tetrahydro-thieno[3,2-b]azepine-4-carbonyl)-phenyl]-amide | CHEMBL369832
TypeSmall organic molecule
Emp. Form.C37H42N4O3S
Mol. Mass.622.819
SMILESCN1CCCN(CCCOc2cc(ccc2NC(=O)c2ccccc2-c2ccccc2)C(=O)N2CCCCc3sccc23)CC1